{"text_format":"1","workbook":"xlsx","n_sheets":14,"sheets":["Index","General Info","Introductory sub-table (I)(a)","Table (I)(a)","Promoter & Promoter Group(I)(b)","Public (I)(c)(i)","Public (I)(c)(ii)","Locked-in shares (I)(d)","DRs(II)(a)","DRs(II)(b)","Voting (III) (a)","TextBlock","Sheet1","Sheet2"],"not_rendered":{"charts":0,"images":1,"macros":1,"external_links":0,"defined_names":0,"comments":0,"pivot_tables":0},"unopened":[],"bounds":{"document_bytes":16777216,"sheet_cells":100000,"rows_first":2000,"rows_last":500,"rows_between":2000,"halvings":0,"cell_chars":16384,"cell_head_chars":4096},"cells_cut":0,"cells_raw":0,"read":"whole","date_system":"1900"}

{"sheet":"Index","index":0,"n_rows":58,"n_cols":10,"rows_kept":58,"cut":false,"hidden":false,"merged":[[20,3,20,9],[5,4,5,8],[6,5,6,8],[7,5,7,8],[8,5,8,8],[9,5,9,8],[12,3,12,9],[13,3,13,9],[14,3,14,9],[17,3,17,9],[18,3,18,9],[19,3,19,9],[34,4,34,8],[21,3,21,9],[22,3,22,9],[25,3,25,9],[26,4,26,8],[27,4,27,8],[28,4,28,8],[29,4,29,8],[30,4,30,8],[31,4,31,8],[32,4,32,8],[33,4,33,8],[50,3,50,9],[35,4,35,8],[38,3,38,9],[39,3,39,9],[40,3,40,9],[41,3,41,9],[42,3,42,9],[43,3,43,9],[44,3,44,9],[45,3,45,9],[48,3,48,9],[49,3,49,9],[57,3,57,9],[51,3,51,9],[52,3,52,9],[53,3,53,9],[54,3,54,9],[55,3,55,9],[56,3,56,9]]}
[]
[]
[]
[]
[]
[null,null,null,null,"                                      XBRL Excel Utility"]
[null,null,null,null,"1.","Overview"]
[null,null,null,null,"2.","Before you begin"]
[null,null,null,null,"3.","Index"]
[null,null,null,null,"4.","Steps for Filing Shareholding Pattern"]
{"$rows_left_out":49}
{"sheet":"General Info","index":1,"n_rows":32,"n_cols":21,"rows_kept":32,"cut":false,"hidden":false,"merged":[[5,3,5,4]]}
[]
[null,null,null,null,null,null,null,null,null,null,"Pre-listing",null,1,1,2000,null,"Actual",null,null,null,"Equity shares"]
[null,null,null,null,null,null,null,null,null,null,"Quarterly",null,2,{"$f":"+N2+1","v":2},{"$f":"+O2+1","v":2001},null,"Thousands",null,null,null,"Preference shares"]
[null,null,null,"Protect Formulae ",null,null,null,null,null,null,"Additional",null,3,{"$f":"+N3+1","v":3},2002,null,"Lakhs",null,null,null,"Differential voting rights shares"]
[null,null,null,null,null,null,null,null,null,null,null,null,{"$f":"+M4+1","v":4},4,2003,null,"Millions"]
[null,null,null,"General information [Abstract]",null,null,null,null,null,null,null,null,5,5,2004,null,"Billions"]
[null,null,null,"Scrip code",523586,null,null,null,null,null,null,null,6,6,2005]
[null,null,null,"Name of the company","Indian Toners & Developers Limited",null,null,null,null,null,"Yes",null,7,7,2006]
[null,null,null,"Class of security","Equity shares",null,null,null,null,null,"No",null,8,8,2007]
[null,null,null,"Type of report","Quarterly",null,null,null,null,null,null,null,{"$f":"+M9+1","v":9},9,2008]
{"$rows_left_out":23}
{"sheet":"Introductory sub-table (I)(a)","index":2,"n_rows":60,"n_cols":8,"rows_kept":60,"cut":false,"hidden":false,"merged":[[22,3,22,4],[21,3,21,4],[23,3,23,7],[25,3,25,7],[31,3,31,4],[57,3,57,4],[56,3,56,4],[49,3,49,7],[55,3,55,4],[57,6,57,7],[5,3,5,6],[6,3,6,7],[8,3,8,7],[14,3,14,4],[15,3,15,7],[32,3,32,7],[38,3,38,4],[40,3,40,7],[42,3,42,7],[48,3,48,4],[39,3,39,4]]}
[]
[]
[]
[]
[]
[null,null,null,"Disclosure of notes on shareholding pattern"]
[null,null,null,"Partly paid-up shares "]
[null,null,null,"ID","Description partly paid-up shares","Number of partly paid-up shares","As a percentage of total number of partly paid-up shares","As a percentage of total number of shares of the company"]
[null,null,null,"Shares held by promoter or promoter group"]
[null,null,null,1,null,null,{"$f":"+IF(F10=\"\",\"\",IF(COUNT(F10,F$23),IFERROR(ROUND((+F10*100)/$F$23,2),0),\"\"))","v":""},{"$f":"+IF(F10=\"\",\"\",IF(COUNT(F10,F$58),IFERROR(ROUND((+F10*100)/$F$58,2),0),\"\"))","v":""}]
{"$rows_left_out":51}
{"sheet":"Table (I)(a)","index":3,"n_rows":137,"n_cols":29,"rows_kept":137,"cut":false,"hidden":false,"merged":[[37,4,37,12],[4,3,4,10],[4,11,4,12],[5,3,6,3],[5,4,6,5],[5,9,5,10],[5,11,5,12],[7,4,7,5],[8,4,8,12],[9,4,9,12],[35,3,35,5],[36,3,36,5],[136,3,136,5],[63,3,63,5],[64,3,64,5],[65,3,65,5],[99,3,99,5],[100,3,100,5],[128,3,128,5],[129,3,129,5],[130,3,130,5],[131,3,131,5],[132,4,132,5],[135,3,135,5]]}
[]
[]
[]
[]
[null,null,null,"Disclosure of notes on fully paid-up shares"]
[null,null,null,"Category code       ","Category of shareholder                                                                        ",null,null,null,null,"Total Shareholding as a percentage of total number of shares",null,"Shares pledged or otherwise encumbered"]
[null,null,null,null,null,null,"Number of shareholders              ","Total number of shares","Number of shares held in dematerialised form","As a percentage of (A+B)             ","As a percentage of (A+B+C)","Number            of                 shares","As   a  percentage "]
[null,null,null,"(I)","(II)",null,"(III)","(IV)","(V)","(VI)","(VII)","(VIII)","(IX)= (VIII)/(IV)*100 ",null,null,null,null,null,null,null,"Angel Investors",null,null,"Angel Investors",null,"Foreign individuals",null,null,"Clearing Members"]
[null,null,null,"(A)","Shareholding of Promoter and Promoter Group",null,null,null,null,null,null,null,null,null,null,null,null,null,null,null,"Directors and their friends or relatives",null,null,"Directors and their friends or relatives",null,"NRI",null,null,"Custodian"]
[null,null,null,"(1)","Indian",null,null,null,null,null,null,null,null,null,null,null,null,null,null,null,"Employee welfare fund",null,null,"Employee welfare fund",null,"Trusts",null,null,"Directors and their friends or relatives"]
{"$rows_left_out":128}
{"sheet":"Promoter & Promoter Group(I)(b)","index":4,"n_rows":25,"n_cols":16,"rows_kept":25,"cut":false,"hidden":false,"merged":[[24,3,24,5],[10,3,10,15],[4,3,4,15],[5,3,5,13],[5,14,5,15],[6,3,7,3],[6,6,6,7],[6,8,6,10],[6,11,6,12],[6,13,6,14]]}
[null,null,null,null,null,null,null,null,12]
[]
[]
[]
[null,null,null,"(I) (b) Statement showing holding of securities (including shares,warrants,convertible securities) of persons belonging to the category \"Promoter and Promoter Group\""]
[null,null,null,"Disclosure of notes on securities belonging to the category \"Promoter and Promoter Group\""]
[null,null,null,"Sr. No. ",null,null,"Details of Shares held",null,"Encumbered Share",null,null,"Details of warrants",null,"Details of convertible securities"]
[null,null,null,null,"Name of the shareholder","PAN of Promoter","Number of the shares held","As a percentage of grand total                 (A) + (B) + (C)","Encumbered  - number of shares","As  a  percentage","As a percentage of grand total (A) + (B) + (C) of clause (I)(a)","Number of  warrants held","Warrants held as a percentage of total numbers of warrants of the same class ","Number of convertible securities held","Convertible securities as percentage of total numbers of convertible securities of same class ","Total shares (including underlying shares assuming full conversion of warrants and convertible securities) as a percentage of diluted share capital"]
[null,null,null,"(I)"," (II)"," (II) (a)","(III)","(IV)","(V)","(VI)=(V)/(III)*100","(I)(a) (VII)","(VIII)","(IX)","(X)","(XI)","(XII)"]
[null,null,null,null,null,null,null,{"$f":"+IFERROR(IF(G10=\"\",\"\",IF(COUNT(G10,'Table (I)(a)'!$H$137),ROUND(SUM('Promoter & Promoter Group(I)(b)'!G10)/SUM('Table (I)(a)'!$H$137)*100,2),\"\")),\"\")","v":""},null,{"$f":"+IFERROR(IF(I10=\"\",\"\",IF(COUNT(G10,I10),ROUND(SUM(I10)/SUM(G10)*100,2),\"\")),\"\")","v":""},{"$f":"+IFERROR(IF(I10=\"\",\"\",IF(COUNT(G10,'Table (I)(a)'!$H$137),ROUND(SUM(I10)/SUM('Table (I)(a)'!$H$137)*100,2),\"\")),\"\")","v":""},null,{"$f":"+IFERROR(IF(L10=\"\",\"\",IF(COUNT(L10,'Introductory sub-table (I)(a)'!$F$49),ROUND(SUM('Promoter & Promoter Group(I)(b)'!L10)/SUM('Introductory sub-table (I)(a)'!$F$49)*100,2),\"\")),\"\")","v":""},null,{"$f":"+IFERROR(IF(N10=\"\",\"\",IF(COUNT(N10,'Introductory sub-table (I)(a)'!$F$32),ROUND(SUM('Promoter & Promoter Group(I)(b)'!N10)/SUM('Introductory sub-table (I)(a)'!$F$32)*100,2),\"\")),\"\")","v":""},{"$f":"+IFERROR(IF(OR(G10,L10,N10)=0,\"\",IF(COUNT(G10,L10,N10,+'Introductory sub-table (I)(a)'!$F$58),ROUND(SUM(G10,L10,N10)*100/(+'Introductory sub-table (I)(a)'!$F$58),2),\"\")),\"\")","v":""}]
{"$rows_left_out":16}
{"sheet":"Public (I)(c)(i)","index":5,"n_rows":15,"n_cols":18,"rows_kept":15,"cut":false,"hidden":false,"merged":[[10,3,10,12],[14,3,14,5],[3,3,3,12],[4,3,4,9],[4,11,4,12],[5,3,5,11],[6,3,7,3],[6,6,6,7],[6,8,6,9],[6,10,6,11]]}
[null,null,null,null,null,null,null,null,2,null,null,null,null,null,null,null,null,"Yes"]
[null,null,null,null,null,null,null,null,null,null,null,null,null,null,null,null,null,"No"]
[]
[null,null,null,"(I) (c) (i) Statement showing holding of securities (including shares,warrants,convertible securities) of persons belonging to the category \"Public\" and holding more than one percentage of the total number of shares"]
[null,null,null,"Whether any security held by public having more than one percentage of total number of shares",null,null,null,null,null,null,"Yes"]
[null,null,null,"Disclosure of notes on holding of securities of persons belonging to the category \"Public\" and holding more than one percentage of the total number of shares"]
[null,null,null,"Sr. No. ",null,null,"Details of Shares held",null,"Details of warrants",null,"Details of convertible securities"]
[null,null,null,null,"Name  of  the  shareholder ","PAN  of   Shareholder","Number of the   shares  held ","Shares as percentage of total number of shares {i.e, Grand Total (A) + (B) + (C) indicated in statement at para (I) (a) above}","Number  of   warrants held","Warrants  held  as a percentage  of total numbers of warrants of  the same class ","Number  of     convertible      securities  held","Convertible  securities  as  percentage of  total numbers of  convertible  securities of  same class ","Total shares (including  underlying shares assuming full  conversion of warrants and convertible  securities) as a percentage of diluted  share capital "]
[null,null,null,"(I)"," (II)"," (II) (a)","(III)","(IV)","(V)","(VI)","(I)(a) (VII)","(VIII)","(IX)"]
[null,null,null,null,null,null,null,{"$f":"+IFERROR(IF(G10=\"\",\"\",IF(COUNT(G10,'Table (I)(a)'!$H$137),ROUND((SUM(G10)/SUM('Table (I)(a)'!$H$137))*100,2),\"\")),\"\")","v":""},null,{"$f":"+IFERROR(IF(I10=\"\",\"\",IF(COUNT(I10,'Introductory sub-table (I)(a)'!$F$56),ROUND(SUM(+I10)/SUM('Introductory sub-table (I)(a)'!$F$56)*100,2),\"\")),\"\")","v":""},null,{"$f":"+IFERROR(IF(K10=\"\",\"\",IF(COUNT(K10,'Introductory sub-table (I)(a)'!$F$39),ROUND(SUM(+K10)/SUM('Introductory sub-table (I)(a)'!$F$39)*100,2),\"\")),\"\")","v":""},{"$f":"+IFERROR(IF(OR(G10,I10,K10)=0,\"\",IF(COUNT(G10,I10,K10,+'Introductory sub-table (I)(a)'!$F$58),ROUND(SUM(G10,I10,K10)*100/(+'Introductory sub-table (I)(a)'!$F$58),2),\"\")),\"\")","v":""}]
{"$rows_left_out":6}
{"sheet":"Public (I)(c)(ii)","index":6,"n_rows":13,"n_cols":18,"rows_kept":13,"cut":false,"hidden":false,"merged":[[12,3,12,5],[3,3,3,12],[4,3,4,9],[4,11,4,12],[5,3,5,11],[6,3,7,3],[6,6,6,7],[6,8,6,9],[6,10,6,11]]}
[null,null,null,null,null,null,null,null,0,null,null,null,null,null,null,null,null,"Yes"]
[null,null,null,null,null,null,null,null,null,null,null,null,null,null,null,null,null,"No"]
[]
[null,null,null,"(I) (c) (ii) Statement showing holding of securities (including shares,warrants,convertible securities) of persons (together with PAC) belonging to the category \"Public\" and holding more than five percentage of the total number of shares of the company"]
[null,null,null,"Whether any person together with PAC belonging to category Public holding more than five percentage of total number of shares ",null,null,null,null,null,null,"No"]
[null,null,null,"Disclosure of notes on holding of securities of persons (together with PAC) belonging to the category \"Public\" and holding more than five percentage of the total number of shares of the company"]
[null,null,null,"Sr. No. ",null,null,"Details of Shares held",null,"Details of warrants",null,"Details of convertible securities"]
[null,null,null,null,"Name  of  the shareholder","PAN  of  Shareholder ","  Number  of  the shares held","Shares as percentage of total number of shares {i.e, Grand Total (A)  +  (B)  +  (C) indicated in statement at para (I) (a) above}","  Number of warrants          held","  Warrants held as a percentage  of  total numbers of warrants of the same class ","  Number                    of convertible securities held","  Convertible securities as percentage  of  total numbers of convertible securities of same class ","  Total shares  (including underlying shares assuming full conversion of warrants and convertible securities) as a percentage of diluted share capital"]
[null,null,null,"(I)"," (II)"," (II) (a)","(III)","(IV)","(V)","(VI)","(I)(a) (VII)","(VIII)","(IX)"]
[null,null,null,null,null,null,null,{"$f":"+IFERROR(IF(G10=\"\",\"\",IF(COUNT(G10,'Table (I)(a)'!$H$137),ROUND(SUM(G10)/SUM('Table (I)(a)'!$H$137)*100,2),\"\")),\"\")","v":""},null,{"$f":"+IFERROR(IF(I10=\"\",\"\",IF(COUNT(I10,'Introductory sub-table (I)(a)'!$F$56),ROUND(SUM(+I10)/SUM('Introductory sub-table (I)(a)'!$F$56)*100,2),\"\")),\"\")","v":""},null,{"$f":"+IFERROR(IF(K10=\"\",\"\",IF(COUNT(K10,'Introductory sub-table (I)(a)'!$F$39),ROUND(SUM(K10)/SUM('Introductory sub-table (I)(a)'!$F$39)*100,2),\"\")),\"\")","v":""},{"$f":"+IFERROR(IF(OR(G10,I10,K10)=0,\"\",IF(COUNT(G10,I10,K10,+'Introductory sub-table (I)(a)'!$F$58),ROUND(SUM(G10,I10,K10)*100/(+'Introductory sub-table (I)(a)'!$F$58),2),\"\")),\"\")","v":""}]
{"$rows_left_out":4}
{"sheet":"Locked-in shares (I)(d)","index":7,"n_rows":12,"n_cols":15,"rows_kept":12,"cut":false,"hidden":false,"merged":[[11,3,11,5],[3,3,3,8],[4,3,4,7],[5,3,5,7],[9,3,9,8],[10,3,10,5]]}
[null,null,null,null,null,null,0]
[]
[null,null,null,null,null,null,null,null,null,null,null,null,null,"Promoter","Yes"]
[null,null,null,"(I) (d) Statement showing details of locked-in shares",null,null,null,null,null,null,null,null,null,"Promoter Group","No"]
[null,null,null,"Whether company has shares locked in",null,null,null,null,"No",null,null,null,null,"Public"]
[null,null,null,"Disclosure of notes on locked-in shares"]
[null,null,null,"Sr. No.","Name  of the Shareholder","PAN of Shareholder","Number of locked-in shares","Locked-in-shares as a percentage of total number of shares held by {i.e., Grand Total (A) + (B) + (C) indicated in Statement at para (I)(a) above}","Promoter / Promoter Group / Public"]
[null,null,null,"(I)"," (II)"," (II)(a)","(III)","(IV)","(V)"]
[null,null,null,null,null,null,null,{"$f":"+IFERROR(IF(G9=\"\",\"\",IF(COUNT(G9,'Table (I)(a)'!$H$137),ROUND(SUM(G9)/SUM('Table (I)(a)'!$H$137)*100,2),\"\")),\"\")","v":""}]
[]
{"$rows_left_out":3}
{"sheet":"DRs(II)(a)","index":8,"n_rows":12,"n_cols":8,"rows_kept":12,"cut":false,"hidden":false,"merged":[[4,3,4,7],[5,3,5,6],[10,3,10,4],[11,3,11,4]]}
[null,null,null,null,null,null,0]
[]
[]
[]
[null,null,null,"(II) (a) Statement showing details of Depository Receipts (DRs)"]
[null,null,null,"Disclosure of notes on depository receipts (DRs)"]
[null,null,null,"Sr. No.","Type of outstanding  DRs","Number of outstanding DRs","Number of shares underlying outstanding DRs","Shares underlying outstanding DRs as a percentage of total number of shares {i.e., Grand Total (A) + (B) + (C) indicated in Statement at para (I)(a) above}"]
[null,null,null,"(I)"," (II)","(IV)","(IV)","(V)"]
[null,null,null,null,null,null,null,{"$f":"+IFERROR(IF(G9=\"\",\"\",IF(COUNT(G9,'Table (I)(a)'!$H$137),ROUND(SUM(G9)/SUM('Table (I)(a)'!$H$137)*100,2),\"\")),\"\")","v":""}]
[]
{"$rows_left_out":3}
{"sheet":"DRs(II)(b)","index":9,"n_rows":12,"n_cols":8,"rows_kept":12,"cut":false,"hidden":false,"merged":[[4,3,4,7],[5,3,5,6],[11,3,11,5]]}
[null,null,null,null,null,null,0]
[]
[]
[]
[null,null,null,"(II) (b) Statement showing holding of Depository Receipts (DRs), where underlying shares held by 'Promoter or Promoter Group' are in excess of one percentage of the total number of shares"]
[null,null,null,"Disclosure of notes of depository receipts (DRs), where underlying shares held by \"Promoter / Promoter Group\" are in excess of one percentage of the total number of shares"]
[null,null,null,"Sr. No.","Name of the DR holder","Type of outstanding DR","Number of shares underlying outstanding   DRs","Shares underlying outstanding  DRs  as  a percentage of total number  of  shares {i.e., Grand Total (A) + (B) + (C) indicated in Statement at para (I)(a) above}"]
[null,null,null,"(I)"," (II)","(IV)","(IV)","(V)"]
[null,null,null,null,null,null,null,{"$f":"+IFERROR(IF(G9=\"\",\"\",IF(COUNT(G9,'Table (I)(a)'!$H$137),ROUND(SUM(G9)/SUM('Table (I)(a)'!$H$137)*100,2),\"\")),\"\")","v":""}]
[]
{"$rows_left_out":3}
{"sheet":"Voting (III) (a)","index":10,"n_rows":138,"n_cols":12,"rows_kept":138,"cut":false,"hidden":false,"merged":[[10,4,10,5],[1,3,1,11],[2,3,2,10],[3,3,4,3],[3,4,4,5],[3,6,3,8],[3,10,3,11],[4,9,6,9],[4,10,6,10],[4,11,6,11],[5,4,5,5],[6,4,6,5],[7,4,7,5],[8,4,8,5],[8,9,8,11],[9,4,9,5],[64,3,64,5],[11,4,11,5],[12,4,12,5],[13,4,13,5],[14,4,14,5],[36,3,36,5],[37,3,37,5],[38,4,38,5],[39,4,39,5],[40,4,40,5],[41,4,41,5],[42,4,42,5],[76,4,76,5],[65,3,65,5],[66,3,66,5],[67,4,67,5],[68,4,68,5],[69,4,69,5],[70,4,70,5],[71,4,71,5],[72,4,72,5],[73,4,73,5],[74,4,74,5],[75,4,75,5],[131,3,131,5],[132,3,132,5],[136,3,136,5],[137,3,137,5],[77,4,77,5],[78,4,78,5],[100,3,100,5],[101,3,101,5],[129,3,129,5],[130,3,130,5]]}
[]
[null,null,null,"(III) (a) Statement showing the voting pattern of Shareholders, if more than one class of shares / securities is issued by the issuer."]
[null,null,null,"Disclosure of notes on voting pattern of Shareholders, if more than one class of shares or securities is issued by the issuer"]
[null,null,null,"No","Category of Shareholders ",null,"Number of Voting Rights held",null,null,null,"Total Voting Rights i.e. (VI)"]
[null,null,null,null,null,null,"Class X","Class Y","Class Z","Total Voting Rights (III+IV+V)","As  a \npercentage  of \n(A+B)","As  a \npercentage  of \n(A+B+C)"]
[null,null,null,"(I)","(II)",null,"(III)","(IV)","(V)"]
[null,null,null,1,"Scrip  code"]
[null,null,null,2,"Type of security",null,null,null,null,"(VI)","(VII)","(VIII)"]
[null,null,null,3,"Number of shares per voting rights"]
[null,null,null,"(A)","Shareholding of Promoter and Promoter Group"]
{"$rows_left_out":129}
{"sheet":"TextBlock","index":11,"n_rows":41,"n_cols":5,"rows_kept":41,"cut":false,"hidden":true,"merged":[]}
[null,null,null,null,47]
[]
[]
[null,"115097100102115102"]
[null,"108111099107101100032105110032115104097114101115032104111108100101114115"]
[]
[null,"068082032100101116097105108115032116111032098101032115101110116"]
[null,"076111099107101100032105110032115104097114101115032100101116097105108115"]
[null,"080117098108105099032049032099032049"]
[null,"080117098108105099032049099049"]
{"$rows_left_out":32}
{"sheet":"Sheet1","index":12,"n_rows":1159,"n_cols":19,"rows_kept":1159,"cut":false,"hidden":true,"merged":[]}
["in-bse-shp","Element","label","Name","depth","order","_Element","From ","To","ScheduleName",null,"type","enumerations","substitutionGroup","balance","periodType","abstract","nillable","BusinessRules"]
["in-bse-shp","GeneralInformationAbstract","General information [Abstract]",null,0,null,"in-bse-shp_GeneralInformationAbstract",null,null,"Detailsofgeneralinformationaboutcompany","xbrli:stringItemType",null,"xbrli:item",null,"duration","true","true",0]
["in-bse-shp","NameOfTheCompany","Name of the company","Name of the company",1,1,"in-bse-shp_NameOfTheCompany","GeneralInformationAbstract","NameOfTheCompany","Detailsofgeneralinformationaboutcompany","xbrli:stringItemType",null,"xbrli:item",null,"duration","false","true",0,"This is a mandatory field. Name should be based on CIN."]
["in-bse-shp","ScripCode","Scrip code","Scrip code",1,2,"in-bse-shp_ScripCode","GeneralInformationAbstract","ScripCode","Detailsofgeneralinformationaboutcompany","in-bse-shp-types:ScripCode",null,"xbrli:item",null,"duration","false","true",0,"This is a mandatory field. Should be valid SCRIP CODE  as per BSE Scrip Code Format. "]
["in-bse-shp","CorporateIdentityNumber","Corporate identity number","Corporate identity number",1,3,"in-bse-shp_CorporateIdentityNumber","GeneralInformationAbstract","CorporateIdentityNumber","Detailsofgeneralinformationaboutcompany","in-bse-shp-types:CINNumber",null,"xbrli:item",null,"duration","false","true",0,"This is a mandatory field."]
["in-bse-shp","AddressOfRegisteredOfficeOfCompany","Address of registered office of company","Address of registered office of company",1,4,"in-bse-shp_AddressOfRegisteredOfficeOfCompany","GeneralInformationAbstract","AddressOfRegisteredOfficeOfCompany","Detailsofgeneralinformationaboutcompany","xbrli:stringItemType",null,"xbrli:item",null,"duration","false","true",0,"This is a mandatory field. "]
["in-bse-shp","PermanentAccountNumberOfEntity","Permanent account number of entity","Permanent account number of entity",1,5,"in-bse-shp_PermanentAccountNumberOfEntity","GeneralInformationAbstract","PermanentAccountNumberOfEntity","Detailsofgeneralinformationaboutcompany","in-bse-shp-types:PANNumber",null,"xbrli:item",null,"duration","false","true",0,"This is a mandatory field. Should be valid PAN as per Income_tax_PAN  format."]
["in-bse-shp","NameOfTheScrip","Name of the scrip","Name of the scrip",1,6,"in-bse-shp_NameOfTheScrip","GeneralInformationAbstract","NameOfTheScrip","Detailsofgeneralinformationaboutcompany","xbrli:stringItemType",null,"xbrli:item",null,"duration","false","true",0,"This is a mandatory field. Should be based on Scip Code."]
["in-bse-shp","ClassOfSecurity","Class of security","Class of security",1,7,"in-bse-shp_ClassOfSecurity","GeneralInformationAbstract","ClassOfSecurity","Detailsofgeneralinformationaboutcompany","in-bse-shp-types:ClassSecurity",null,"xbrli:item",null,"duration","false","true",0,"This is a mandatory field."]
["in-bse-shp","TypeOfReport","Type of report","Type of report",1,10,"in-bse-shp_TypeOfReport","GeneralInformationAbstract","TypeOfReport","Detailsofgeneralinformationaboutcompany","in-bse-shp-types:ReportType","(Quarterly) (Additional) ","xbrli:item",null,"duration","false","true",0,"This is a mandatory field. Select from drop down list"]
{"$rows_left_out":1150}
{"sheet":"Sheet2","index":13,"n_rows":0,"n_cols":0,"rows_kept":0,"cut":false,"hidden":true,"merged":[]}